Reaction Details
TargetMetabotropic glutamate receptor 5
LigandBDBM50113468
Substrate/Competitorn/a
Meas. Tech.ChEMBL_1510803 (CHEMBL3606567)
IC50 2.5±n/a nM
Citation Christopher, JAAves, SJBennett, KADoré, ASErrey, JCJazayeri, AMarshall, FHOkrasa, KSerrano-Vega, MJTehan, BGWiggin, GRCongreve, M Fragment and Structure-Based Drug Discovery for a Class C GPCR: Discovery of the mGlu5 Negative Allosteric Modulator HTL14242 (3-Chloro-5-[6-(5-fluoropyridin-2-yl)pyrimidin-4-yl]benzonitrile). J Med Chem58:6653-64 (2015) 
 
Metabotropic glutamate receptor 5
Name:Metabotropic glutamate receptor 5
Type:Enzyme
Mol. Mass.:132484.72
Organism:Homo sapiens (Human)
Description:n/a
Residue:1212
BDBM50113468
NameBDBM50113468
Synonyms:CHEMBL3603915 US10584111, Ex No. 15 | US11584732, Example 15
TypeSmall organic molecule
Emp. Form.C14H7ClFN5
Mol. Mass.299.69
SMILESFc1c(Cl)cc(cc1-c1cc(ncn1)-n1cccn1)C#N