Reaction Details
TargetHistone deacetylase 1
LigandBDBM50113969
Substrate/Competitorn/a
Meas. Tech.ChEMBL_1510857 (CHEMBL3606693)
IC50 290±n/a nM
Citation Marson, CMMatthews, CJAtkinson, SJLamadema, NThomas, NS Potent and Selective Inhibitors of Histone Deacetylase-3 Containing Chiral Oxazoline Capping Groups and a N-(2-Aminophenyl)-benzamide Binding Unit. J Med Chem58:6803-18 (2015) 
 
Histone deacetylase 1
Name:Histone deacetylase 1
Type:Enzyme
Mol. Mass.:55090.27
Organism:Homo sapiens (Human)
Description:Q13547
Residue:482
BDBM50113969
NameBDBM50113969
Synonyms:CHEMBL3605499
TypeSmall organic molecule
Emp. Form.C23H22N4O3
Mol. Mass.402.4458
SMILESNc1ccccc1NC(=O)c1ccc(CNC2=N[C@H](CO2)c2ccc(O)cc2)cc1