Reaction Details
TargetPolyamine deacetylase HDAC10
LigandBDBM50113971
Substrate/Competitorn/a
Meas. Tech.ChEMBL_1510871 (CHEMBL3606707)
IC50>100000±n/a nM
Citation Marson, CMMatthews, CJAtkinson, SJLamadema, NThomas, NS Potent and Selective Inhibitors of Histone Deacetylase-3 Containing Chiral Oxazoline Capping Groups and a N-(2-Aminophenyl)-benzamide Binding Unit. J Med Chem58:6803-18 (2015) 
 
Polyamine deacetylase HDAC10
Name:Polyamine deacetylase HDAC10
Type:Chromatin regulator; hydrolase; repressor
Mol. Mass.:71431.89
Organism:Homo sapiens (Human)
Description:Q969S8
Residue:669
BDBM50113971
NameBDBM50113971
Synonyms:CHEMBL3605506
TypeSmall organic molecule
Emp. Form.C29H26N4O2
Mol. Mass.462.5423
SMILESNc1ccccc1NC(=O)c1ccc(CNC2=N[C@@H]([C@@H](O2)c2ccccc2)c2ccccc2)cc1