Reaction Details
TargetHistone deacetylase 8
LigandBDBM50113958
Substrate/Competitorn/a
Meas. Tech.ChEMBL_1510863 (CHEMBL3606699)
IC50 63000±n/a nM
Citation Marson, CMMatthews, CJAtkinson, SJLamadema, NThomas, NS Potent and Selective Inhibitors of Histone Deacetylase-3 Containing Chiral Oxazoline Capping Groups and a N-(2-Aminophenyl)-benzamide Binding Unit. J Med Chem58:6803-18 (2015) 
 
Histone deacetylase 8
Name:Histone deacetylase 8
Type:Enzyme
Mol. Mass.:41749.60
Organism:Homo sapiens (Human)
Description:Q9BY41
Residue:377
BDBM50113958
NameBDBM50113958
Synonyms:CHEMBL3605501
TypeSmall organic molecule
Emp. Form.C24H24N4O2
Mol. Mass.400.473
SMILESNc1ccccc1NC(=O)c1ccc(CNC2=N[C@@H](Cc3ccccc3)CO2)cc1