Reaction Details
TargetHistone deacetylase 2
LigandBDBM50113972
Substrate/Competitorn/a
Meas. Tech.ChEMBL_1510859 (CHEMBL3606695)
IC50 430±n/a nM
Citation Marson, CMMatthews, CJAtkinson, SJLamadema, NThomas, NS Potent and Selective Inhibitors of Histone Deacetylase-3 Containing Chiral Oxazoline Capping Groups and a N-(2-Aminophenyl)-benzamide Binding Unit. J Med Chem58:6803-18 (2015) 
 
Histone deacetylase 2
Name:Histone deacetylase 2
Type:Chromatin regulator; hydrolase; repressor
Mol. Mass.:55356.54
Organism:Homo sapiens (Human)
Description:Q92769
Residue:488
BDBM50113972
NameBDBM50113972
Synonyms:CHEMBL3605500
TypeSmall organic molecule
Emp. Form.C22H21N5O2
Mol. Mass.387.4344
SMILESNc1ccccc1NC(=O)c1ccc(CNC2=N[C@H](CO2)c2cccnc2)cc1