Reaction Details
TargetKappa-type opioid receptor
LigandBDBM50114369
Substrate/Competitorn/a
Meas. Tech.ChEMBL_1511479 (CHEMBL3606828)
Ki 4250±n/a nM
Citation Loriga, GLazzari, PManca, IRuiu, SFalzoi, MMurineddu, GBottazzi, MEPinna, GPinna, GA Novel diazabicycloalkane delta opioid agonists. Bioorg Med Chem23:5527-38 (2015) 
 
Kappa-type opioid receptor
Name:Kappa-type opioid receptor
Type:Enzyme
Mol. Mass.:42656.78
Organism:Mus musculus (Mouse)
Description:P33534
Residue:380
BDBM50114369
NameBDBM50114369
Synonyms:CHEMBL3604282
TypeSmall organic molecule
Emp. Form.C30H41N3O2
Mol. Mass.475.6654
SMILESCCN(CC)C(=O)c1ccc(cc1)C(N1CCC2CCCC(C1)N2CC=C)c1cccc(OC)c1