Reaction Details
TargetDelta-type opioid receptor
LigandBDBM50114369
Substrate/Competitorn/a
Meas. Tech.ChEMBL_1511478 (CHEMBL3606827)
Ki 9.1±n/a nM
Citation Loriga, GLazzari, PManca, IRuiu, SFalzoi, MMurineddu, GBottazzi, MEPinna, GPinna, GA Novel diazabicycloalkane delta opioid agonists. Bioorg Med Chem23:5527-38 (2015) 
 
Delta-type opioid receptor
Name:Delta-type opioid receptor
Type:Enzyme Catalytic Domain
Mol. Mass.:40577.25
Organism:MOUSE
Description:P32300
Residue:372
BDBM50114369
NameBDBM50114369
Synonyms:CHEMBL3604282
TypeSmall organic molecule
Emp. Form.C30H41N3O2
Mol. Mass.475.6654
SMILESCCN(CC)C(=O)c1ccc(cc1)C(N1CCC2CCCC(C1)N2CC=C)c1cccc(OC)c1