Reaction Details
TargetCytochrome P450 2C9
LigandBDBM50114571
Substrate/Competitorn/a
Meas. Tech.ChEMBL_1513823 (CHEMBL3611141)
EC50 88±n/a nM
Citation Bae, IHKim, HSYou, YChough, CChoe, WSeon, MKLee, SGKeum, GJang, SKMoon Kim, B Novel benzidine and diaminofluorene prolinamide derivatives as potent hepatitis C virus NS5A inhibitors. Eur J Med Chem101:163-78 (2015) 
 
Cytochrome P450 2C9
Name:Cytochrome P450 2C9
Type:Enzyme
Mol. Mass.:55636.33
Organism:Homo sapiens (Human)
Description:P11712
Residue:490
BDBM50114571
NameBDBM50114571
Synonyms:CHEMBL3608915
TypeSmall organic molecule
Emp. Form.C42H42F2N6O8
Mol. Mass.796.8151
SMILESCOC(=O)N[C@@H](C(=O)N1CCC[C@H]1C(=O)Nc1ccc(c(F)c1)-c1ccc(NC(=O)[C@@H]2CCCN2C(=O)[C@H](NC(=O)OC)c2ccccc2)cc1F)c1ccccc1