Reaction Details
TargetCytochrome P450 2C9
LigandBDBM50114574
Substrate/Competitorn/a
Meas. Tech.ChEMBL_1513823 (CHEMBL3611141)
EC50 277±n/a nM
Citation Bae, IHKim, HSYou, YChough, CChoe, WSeon, MKLee, SGKeum, GJang, SKMoon Kim, B Novel benzidine and diaminofluorene prolinamide derivatives as potent hepatitis C virus NS5A inhibitors. Eur J Med Chem101:163-78 (2015) 
 
Cytochrome P450 2C9
Name:Cytochrome P450 2C9
Type:Enzyme
Mol. Mass.:55636.33
Organism:Homo sapiens (Human)
Description:P11712
Residue:490
BDBM50114574
NameBDBM50114574
Synonyms:CHEMBL3608921
TypeSmall organic molecule
Emp. Form.C43H42F2N6O8
Mol. Mass.808.8258
SMILESCOC(=O)N[C@@H](C(=O)N1CCC[C@H]1C(=O)Nc1ccc2-c3ccc(NC(=O)[C@@H]4CCCN4C(=O)[C@H](NC(=O)OC)c4ccccc4)cc3C(F)(F)c2c1)c1ccccc1