Reaction Details
TargetCytochrome P450 2D6
LigandBDBM50114574
Substrate/Competitorn/a
Meas. Tech.ChEMBL_1513824 (CHEMBL3611142)
EC50>100000±n/a nM
Citation Bae, IHKim, HSYou, YChough, CChoe, WSeon, MKLee, SGKeum, GJang, SKMoon Kim, B Novel benzidine and diaminofluorene prolinamide derivatives as potent hepatitis C virus NS5A inhibitors. Eur J Med Chem101:163-78 (2015) 
 
Cytochrome P450 2D6
Name:Cytochrome P450 2D6
Type:Protein
Mol. Mass.:55774.82
Organism:Homo sapiens (Human)
Description:P10635
Residue:497
BDBM50114574
NameBDBM50114574
Synonyms:CHEMBL3608921
TypeSmall organic molecule
Emp. Form.C43H42F2N6O8
Mol. Mass.808.8258
SMILESCOC(=O)N[C@@H](C(=O)N1CCC[C@H]1C(=O)Nc1ccc2-c3ccc(NC(=O)[C@@H]4CCCN4C(=O)[C@H](NC(=O)OC)c4ccccc4)cc3C(F)(F)c2c1)c1ccccc1