Reaction Details
TargetCytochrome P450 3A4
LigandBDBM50114573
Substrate/Competitorn/a
Meas. Tech.ChEMBL_1513826 (CHEMBL3611144)
EC50 1030±n/a nM
Citation Bae, IHKim, HSYou, YChough, CChoe, WSeon, MKLee, SGKeum, GJang, SKMoon Kim, B Novel benzidine and diaminofluorene prolinamide derivatives as potent hepatitis C virus NS5A inhibitors. Eur J Med Chem101:163-78 (2015) 
 
Cytochrome P450 3A4
Name:Cytochrome P450 3A4
Type:Enzyme
Mol. Mass.:57349.57
Organism:Homo sapiens (Human)
Description:n/a
Residue:503
BDBM50114573
NameBDBM50114573
Synonyms:CHEMBL3608920
TypeSmall organic molecule
Emp. Form.C45H48N6O8
Mol. Mass.800.898
SMILESCOC(=O)N[C@@H](C(=O)N1CCC[C@H]1C(=O)Nc1ccc2-c3ccc(NC(=O)[C@@H]4CCCN4C(=O)[C@H](NC(=O)OC)c4ccccc4)cc3C(C)(C)c2c1)c1ccccc1