Reaction Details
TargetCarbonic anhydrase 9
LigandBDBM50114857
Substrate/Competitorn/a
Meas. Tech.ChEMBL_1512515 (CHEMBL3610379)
Ki 28±n/a nM
Citation Krasavin, MKorsakov, MDorogov, MTuccinardi, TDedeoglu, NSupuran, CT Probing the 'bipolar' nature of the carbonic anhydrase active site: aromatic sulfonamides containing 1,3-oxazol-5-yl moiety as picomolar inhibitors of cytosolic CA I and CA II isoforms. Eur J Med Chem101:334-47 (2015) 
 
Carbonic anhydrase 9
Name:Carbonic anhydrase 9
Type:Enzyme
Mol. Mass.:49669.03
Organism:Homo sapiens (Human)
Description:Catalytic domain of human cloned isozyme was used in the assay
Residue:459
BDBM50114857
NameBDBM50114857
Synonyms:CHEMBL3608894
TypeSmall organic molecule
Emp. Form.C12H13N3O5S2
Mol. Mass.343.379
SMILESNS(=O)(=O)c1cc(cs1)-c1cnc(o1)C(=O)N1CCOCC1