Reaction Details
TargetCarbonic anhydrase 12
LigandBDBM50114865
Substrate/Competitorn/a
Meas. Tech.ChEMBL_1512516 (CHEMBL3610380)
Ki 1395±n/a nM
Citation Krasavin, MKorsakov, MDorogov, MTuccinardi, TDedeoglu, NSupuran, CT Probing the 'bipolar' nature of the carbonic anhydrase active site: aromatic sulfonamides containing 1,3-oxazol-5-yl moiety as picomolar inhibitors of cytosolic CA I and CA II isoforms. Eur J Med Chem101:334-47 (2015) 
 
Carbonic anhydrase 12
Name:Carbonic anhydrase 12
Type:Enzyme
Mol. Mass.:39456.00
Organism:Homo sapiens (Human)
Description:Catalytic domain of human cloned isozyme was used in the assay
Residue:354
BDBM50114865
NameBDBM50114865
Synonyms:CHEMBL3608877
TypeSmall organic molecule
Emp. Form.C14H16N2O3S
Mol. Mass.292.353
SMILESCc1ccc(cc1S(N)(=O)=O)-c1cnc(o1)C1CCC1