Reaction Details
TargetCarbonic anhydrase 1
LigandBDBM50114866
Substrate/Competitorn/a
Meas. Tech.ChEMBL_1512513 (CHEMBL3610377)
Ki>10000±n/a nM
Citation Krasavin, MKorsakov, MDorogov, MTuccinardi, TDedeoglu, NSupuran, CT Probing the 'bipolar' nature of the carbonic anhydrase active site: aromatic sulfonamides containing 1,3-oxazol-5-yl moiety as picomolar inhibitors of cytosolic CA I and CA II isoforms. Eur J Med Chem101:334-47 (2015) 
 
Carbonic anhydrase 1
Name:Carbonic anhydrase 1
Type:Enzyme
Mol. Mass.:28873.37
Organism:Homo sapiens (Human)
Description:P00915
Residue:261
BDBM50114866
NameBDBM50114866
Synonyms:CHEMBL3608878
TypeSmall organic molecule
Emp. Form.C11H12N2O4S
Mol. Mass.268.289
SMILESCOc1ccc(cc1S(N)(=O)=O)-c1cnc(C)o1