Reaction Details
TargetCarbonic anhydrase 12
LigandBDBM50114849
Substrate/Competitorn/a
Meas. Tech.ChEMBL_1512516 (CHEMBL3610380)
Ki 9.2±n/a nM
Citation Krasavin, MKorsakov, MDorogov, MTuccinardi, TDedeoglu, NSupuran, CT Probing the 'bipolar' nature of the carbonic anhydrase active site: aromatic sulfonamides containing 1,3-oxazol-5-yl moiety as picomolar inhibitors of cytosolic CA I and CA II isoforms. Eur J Med Chem101:334-47 (2015) 
 
Carbonic anhydrase 12
Name:Carbonic anhydrase 12
Type:Enzyme
Mol. Mass.:39456.00
Organism:Homo sapiens (Human)
Description:Catalytic domain of human cloned isozyme was used in the assay
Residue:354
BDBM50114849
NameBDBM50114849
Synonyms:CHEMBL3608886
TypeSmall organic molecule
Emp. Form.C10H10N2O3S2
Mol. Mass.270.328
SMILESNS(=O)(=O)c1ccc(s1)-c1cnc(o1)C1CC1