Reaction Details
TargetCarbonic anhydrase 12
LigandBDBM50114855
Substrate/Competitorn/a
Meas. Tech.ChEMBL_1512516 (CHEMBL3610380)
Ki 6.6±n/a nM
Citation Krasavin, MKorsakov, MDorogov, MTuccinardi, TDedeoglu, NSupuran, CT Probing the 'bipolar' nature of the carbonic anhydrase active site: aromatic sulfonamides containing 1,3-oxazol-5-yl moiety as picomolar inhibitors of cytosolic CA I and CA II isoforms. Eur J Med Chem101:334-47 (2015) 
 
Carbonic anhydrase 12
Name:Carbonic anhydrase 12
Type:Enzyme
Mol. Mass.:39456.00
Organism:Homo sapiens (Human)
Description:Catalytic domain of human cloned isozyme was used in the assay
Residue:354
BDBM50114855
NameBDBM50114855
Synonyms:CHEMBL3608892
TypeSmall organic molecule
Emp. Form.C11H12N2O3S2
Mol. Mass.284.355
SMILESNS(=O)(=O)c1cc(cs1)-c1cnc(o1)C1CCC1