Reaction Details
TargetCarbonic anhydrase 9
LigandBDBM50114858
Substrate/Competitorn/a
Meas. Tech.ChEMBL_1512515 (CHEMBL3610379)
Ki 23±n/a nM
Citation Krasavin, MKorsakov, MDorogov, MTuccinardi, TDedeoglu, NSupuran, CT Probing the 'bipolar' nature of the carbonic anhydrase active site: aromatic sulfonamides containing 1,3-oxazol-5-yl moiety as picomolar inhibitors of cytosolic CA I and CA II isoforms. Eur J Med Chem101:334-47 (2015) 
 
Carbonic anhydrase 9
Name:Carbonic anhydrase 9
Type:Enzyme
Mol. Mass.:49669.03
Organism:Homo sapiens (Human)
Description:Catalytic domain of human cloned isozyme was used in the assay
Residue:459
BDBM50114858
NameBDBM50114858
Synonyms:CHEMBL3608870
TypeSmall organic molecule
Emp. Form.C10H10N2O3S
Mol. Mass.238.263
SMILESCc1ncc(o1)-c1ccc(cc1)S(N)(=O)=O