Reaction Details
TargetC-X-C chemokine receptor type 1
LigandBDBM50115226
Substrate/Competitorn/a
Meas. Tech.ChEMBL_1513745 (CHEMBL3610855)
IC50 2050±n/a nM
Citation Schuler, ADEngles, CAMaeda, DYQuinn, MTKirpotina, LNWicomb, WNMason, SNAuten, RLZebala, JA Boronic acid-containing aminopyridine- and aminopyrimidinecarboxamide CXCR1/2 antagonists: Optimization of aqueous solubility and oral bioavailability. Bioorg Med Chem Lett25:3793-7 (2015) 
 
C-X-C chemokine receptor type 1
Name:C-X-C chemokine receptor type 1
Type:Enzyme
Mol. Mass.:39803.83
Organism:Homo sapiens (Human)
Description:P25024
Residue:350
BDBM50115226
NameBDBM50115226
Synonyms:CHEMBL3609019
TypeSmall organic molecule
Emp. Form.C23H20BFN6O3
Mol. Mass.458.253
SMILESOB(O)c1ccc(CN(Cc2ccccn2)c2ncc(cn2)C(=O)Nc2ccc(F)cc2)nc1