Reaction Details
TargetProthrombin
LigandBDBM50307871
Substrate/Competitorn/a
Meas. Tech.ChEMBL_1513929 (CHEMBL3611611)
Kd 110±n/a nM
Citation Rühmann, EBetz, MHeine, AKlebe, G Fragment Binding Can Be Either More Enthalpy-Driven or Entropy-Driven: Crystal Structures and Residual Hydration Patterns Suggest Why. J Med Chem58:6960-71 (2015) 
 
Prothrombin
Name:Prothrombin
Type:Protein
Mol. Mass.:70029.57
Organism:Homo sapiens (Human)
Description:P00734
Residue:622
BDBM50307871
NameBDBM50307871
Synonyms:(S)-1-((R)-2-aminobutanoyl)-N-(4-carbamimidoylbenzyl)pyrrolidine-2-carboxamide dihydrochloride | CHEMBL597202
TypeSmall organic molecule
Emp. Form.C17H25N5O2
Mol. Mass.331.4127
SMILESCC[C@@H](N)C(=O)N1CCC[C@H]1C(=O)NCc1ccc(cc1)C(N)=N