Reaction Details
TargetProthrombin
LigandBDBM50115489
Substrate/Competitorn/a
Meas. Tech.ChEMBL_1513929 (CHEMBL3611611)
Kd 1003000±n/a nM
Citation Rühmann, EBetz, MHeine, AKlebe, G Fragment Binding Can Be Either More Enthalpy-Driven or Entropy-Driven: Crystal Structures and Residual Hydration Patterns Suggest Why. J Med Chem58:6960-71 (2015) 
 
Prothrombin
Name:Prothrombin
Type:Protein
Mol. Mass.:70029.57
Organism:Homo sapiens (Human)
Description:P00734
Residue:622
BDBM50115489
NameBDBM50115489
Synonyms:CHEMBL1571193
TypeSmall organic molecule
Emp. Form.C13H12N2O2
Mol. Mass.228.2466
SMILESCOc1ccc(cc1)C(=O)Nc1ccccn1