Reaction Details
TargetProthrombin
LigandBDBM50038002
Substrate/Competitorn/a
Meas. Tech.ChEMBL_1513929 (CHEMBL3611611)
Kd 355000±n/a nM
Citation Rühmann, EBetz, MHeine, AKlebe, G Fragment Binding Can Be Either More Enthalpy-Driven or Entropy-Driven: Crystal Structures and Residual Hydration Patterns Suggest Why. J Med Chem58:6960-71 (2015) 
 
Prothrombin
Name:Prothrombin
Type:Protein
Mol. Mass.:70029.57
Organism:Homo sapiens (Human)
Description:P00734
Residue:622
BDBM50038002
NameBDBM50038002
Synonyms:Benzamidine (Protonated) CHEMBL537204 | benzamidine
TypeSmall organic molecule
Emp. Form.C7H8N2
Mol. Mass.120.1518
SMILESNC(=N)c1ccccc1