Reaction Details
TargetMu-type opioid receptor
LigandBDBM50116081
Substrate/Competitorn/a
Meas. Tech.ChEMBL_1514814 (CHEMBL3615232)
Ki 35280±n/a nM
Citation Nieto, CTGonzalez-Nunez, VRodríguez, REDiez, DGarrido, NM Design, synthesis, pharmacological evaluation and molecular dynamics ofß-amino acids morphan-derivatives as novel ligands for opioid receptors. Eur J Med Chem101:150-62 (2015) 
 
Mu-type opioid receptor
Name:Mu-type opioid receptor
Type:PROTEIN
Mol. Mass.:43012.33
Organism:Danio rerio
Description:ChEMBL_109864
Residue:382
BDBM50116081
NameBDBM50116081
Synonyms:CHEMBL3612238
TypeSmall organic molecule
Emp. Form.C10H18ClNO2
Mol. Mass.219.708
SMILESCl.[H][C@@]12CCC[C@@]([H])(NCC1)[C@@H]2C(=O)OC