Reaction Details
TargetMu-type opioid receptor
LigandBDBM50116153
Substrate/Competitorn/a
Meas. Tech.ChEMBL_1514814 (CHEMBL3615232)
Ki 36980±n/a nM
Citation Nieto, CTGonzalez-Nunez, VRodríguez, REDiez, DGarrido, NM Design, synthesis, pharmacological evaluation and molecular dynamics ofß-amino acids morphan-derivatives as novel ligands for opioid receptors. Eur J Med Chem101:150-62 (2015) 
 
Mu-type opioid receptor
Name:Mu-type opioid receptor
Type:PROTEIN
Mol. Mass.:43012.33
Organism:Danio rerio
Description:ChEMBL_109864
Residue:382
BDBM50116153
NameBDBM50116153
Synonyms:CHEMBL3612239
TypeSmall organic molecule
Emp. Form.C17H24ClNO2
Mol. Mass.309.831
SMILESCl.[H][C@]12CCC[C@]([H])([C@@H]1C(=O)OC)N(Cc1ccccc1)CC2