Reaction Details
TargetMu-type opioid receptor
LigandBDBM50116155
Substrate/Competitorn/a
Meas. Tech.ChEMBL_1514814 (CHEMBL3615232)
Ki 32000±n/a nM
Citation Nieto, CTGonzalez-Nunez, VRodríguez, REDiez, DGarrido, NM Design, synthesis, pharmacological evaluation and molecular dynamics ofß-amino acids morphan-derivatives as novel ligands for opioid receptors. Eur J Med Chem101:150-62 (2015) 
 
Mu-type opioid receptor
Name:Mu-type opioid receptor
Type:PROTEIN
Mol. Mass.:43012.33
Organism:Danio rerio
Description:ChEMBL_109864
Residue:382
BDBM50116155
NameBDBM50116155
Synonyms:CHEMBL3612240
TypeSmall organic molecule
Emp. Form.C15H20ClNO2
Mol. Mass.281.778
SMILESCl.[H][C@@]12CCC[C@@]([H])(NCC1)[C@@H]2C(=O)Oc1ccccc1