Reaction Details
TargetD(3) dopamine receptor
LigandBDBM50116299
Substrate/Competitorn/a
Meas. Tech.ChEMBL_1514959 (CHEMBL3615825)
Ki 3.3±n/a nM
Citation Matera, CPucci, LFiorentini, CFucile, SMissale, CGrazioso, GClementi, FZoli, MDe Amici, MGotti, CDallanoce, C Bifunctional compounds targeting both D2 and non-a7 nACh receptors: design, synthesis and pharmacological characterization. Eur J Med Chem101:367-83 (2015) 
 
D(3) dopamine receptor
Name:D(3) dopamine receptor
Type:n/a
Mol. Mass.:44243.43
Organism:Homo sapiens (Human)
Description:n/a
Residue:400
BDBM50116299
NameBDBM50116299
Synonyms:CHEMBL3612360
TypeSmall organic molecule
Emp. Form.C30H46BrN3O2
Mol. Mass.560.609
SMILES[Br-].CN1CCC[C@H]1c1ccc[n+](CCCCCCCCCCNCC2CCc3ccc(O)cc3O2)c1