Reaction Details
TargetD(2) dopamine receptor
LigandBDBM50116199
Substrate/Competitorn/a
Meas. Tech.ChEMBL_1514952 (CHEMBL3615818)
Ki 97±n/a nM
Citation Matera, CPucci, LFiorentini, CFucile, SMissale, CGrazioso, GClementi, FZoli, MDe Amici, MGotti, CDallanoce, C Bifunctional compounds targeting both D2 and non-a7 nACh receptors: design, synthesis and pharmacological characterization. Eur J Med Chem101:367-83 (2015) 
 
D(2) dopamine receptor
Name:D(2) dopamine receptor
Type:G Protein-Coupled Receptor (GPCR)
Mol. Mass.:50931.60
Organism:Rattus norvegicus (rat)
Description:P61169
Residue:444
BDBM50116199
NameBDBM50116199
Synonyms:CHEMBL3612359
TypeSmall organic molecule
Emp. Form.C26H38BrN3O2
Mol. Mass.504.503
SMILES[Br-].CN1CCC[C@H]1c1ccc[n+](CCCCCCNCC2CCc3ccc(O)cc3O2)c1