Reaction Details
TargetCarbonic anhydrase 1
LigandBDBM50116364
Substrate/Competitorn/a
Meas. Tech.ChEMBL_1511757 (CHEMBL3607714)
Ki 767±n/a nM
Citation Mollica, ACostante, RAkdemir, ACarradori, SStefanucci, AMacedonio, GCeruso, MSupuran, CT Exploring new Probenecid-based carbonic anhydrase inhibitors: Synthesis, biological evaluation and docking studies. Bioorg Med Chem23:5311-8 (2015) 
 
Carbonic anhydrase 1
Name:Carbonic anhydrase 1
Type:Enzyme
Mol. Mass.:28873.37
Organism:Homo sapiens (Human)
Description:P00915
Residue:261
BDBM50116364
NameBDBM50116364
Synonyms:CHEMBL3604513
TypeSmall organic molecule
Emp. Form.C21H33F3N6O6S
Mol. Mass.554.584
SMILESOC(=O)C(F)(F)F.CCCN(CCC)S(=O)(=O)c1ccc(cc1)C(=O)N[C@@H](CCCNC(N)=N)C(N)=O