Reaction Details
TargetCarbonic anhydrase 12
LigandBDBM50116437
Substrate/Competitorn/a
Meas. Tech.ChEMBL_1511811 (CHEMBL3608013)
Ki 11±n/a nM
Citation Mollica, ACostante, RAkdemir, ACarradori, SStefanucci, AMacedonio, GCeruso, MSupuran, CT Exploring new Probenecid-based carbonic anhydrase inhibitors: Synthesis, biological evaluation and docking studies. Bioorg Med Chem23:5311-8 (2015) 
 
Carbonic anhydrase 12
Name:Carbonic anhydrase 12
Type:Enzyme
Mol. Mass.:39456.00
Organism:Homo sapiens (Human)
Description:Catalytic domain of human cloned isozyme was used in the assay
Residue:354
BDBM50116437
NameBDBM50116437
Synonyms:CHEMBL3604415
TypeSmall organic molecule
Emp. Form.C18H28N2O5S2
Mol. Mass.416.555
SMILESCCCN(CCC)S(=O)(=O)c1ccc(cc1)C(=O)N[C@@H](CCSC)C(O)=O