Reaction Details
TargetCarbonic anhydrase 9
LigandBDBM50116427
Substrate/Competitorn/a
Meas. Tech.ChEMBL_1511810 (CHEMBL3608012)
Ki 25±n/a nM
Citation Mollica, ACostante, RAkdemir, ACarradori, SStefanucci, AMacedonio, GCeruso, MSupuran, CT Exploring new Probenecid-based carbonic anhydrase inhibitors: Synthesis, biological evaluation and docking studies. Bioorg Med Chem23:5311-8 (2015) 
 
Carbonic anhydrase 9
Name:Carbonic anhydrase 9
Type:Enzyme
Mol. Mass.:49669.03
Organism:Homo sapiens (Human)
Description:Catalytic domain of human cloned isozyme was used in the assay
Residue:459
BDBM50116427
NameBDBM50116427
Synonyms:CHEMBL3604419
TypeSmall organic molecule
Emp. Form.C22H29N3O4S
Mol. Mass.431.548
SMILESCCCN(CCC)S(=O)(=O)c1ccc(cc1)C(=O)N[C@@H](Cc1ccccc1)C(N)=O