Reaction Details
TargetCarbonic anhydrase 2
LigandBDBM50116365
Substrate/Competitorn/a
Meas. Tech.ChEMBL_1511809 (CHEMBL3608011)
Ki>10000±n/a nM
Citation Mollica, ACostante, RAkdemir, ACarradori, SStefanucci, AMacedonio, GCeruso, MSupuran, CT Exploring new Probenecid-based carbonic anhydrase inhibitors: Synthesis, biological evaluation and docking studies. Bioorg Med Chem23:5311-8 (2015) 
 
Carbonic anhydrase 2
Name:Carbonic anhydrase 2
Type:Enzyme
Mol. Mass.:29250.71
Organism:Homo sapiens (Human)
Description:P00918
Residue:260
BDBM50116365
NameBDBM50116365
Synonyms:CHEMBL3604512
TypeSmall organic molecule
Emp. Form.C21H33F3N4O6S
Mol. Mass.526.57
SMILESOC(=O)C(F)(F)F.CCCN(CCC)S(=O)(=O)c1ccc(cc1)C(=O)N[C@@H](CCCCN)C(N)=O