Reaction Details
TargetCarbonic anhydrase 2
LigandBDBM50116435
Substrate/Competitorn/a
Meas. Tech.ChEMBL_1511809 (CHEMBL3608011)
Ki>10000±n/a nM
Citation Mollica, ACostante, RAkdemir, ACarradori, SStefanucci, AMacedonio, GCeruso, MSupuran, CT Exploring new Probenecid-based carbonic anhydrase inhibitors: Synthesis, biological evaluation and docking studies. Bioorg Med Chem23:5311-8 (2015) 
 
Carbonic anhydrase 2
Name:Carbonic anhydrase 2
Type:Enzyme
Mol. Mass.:29250.71
Organism:Homo sapiens (Human)
Description:P00918
Residue:260
BDBM50116435
NameBDBM50116435
Synonyms:CHEMBL3604417
TypeSmall organic molecule
Emp. Form.C16H25N3O4S
Mol. Mass.355.452
SMILESCCCN(CCC)S(=O)(=O)c1ccc(cc1)C(=O)N[C@@H](C)C(N)=O