Reaction Details
TargetMetabotropic glutamate receptor 4
LigandBDBM50293720
Substrate/Competitorn/a
Meas. Tech.ChEMBL_1512615 (CHEMBL3610662)
IC50 4.6±n/a nM
Citation Zhang, ZKil, KEPoutiainen, PChoi, JKKang, HJHuang, XPRoth, BLBrownell, AL Re-exploring the N-phenylpicolinamide derivatives to develop mGlu4 ligands with improved affinity and in vitro microsomal stability. Bioorg Med Chem Lett25:3956-60 (2015) 
 
Metabotropic glutamate receptor 4
Name:Metabotropic glutamate receptor 4
Type:Protein
Mol. Mass.:101899.95
Organism:Homo sapiens (Human)
Description:Q14833
Residue:912
BDBM50293720
NameBDBM50293720
Synonyms:CHEMBL541754 cid_44189740
TypeSmall organic molecule
Emp. Form.C13H10F2N2O2
Mol. Mass.264.2275
SMILESFC(F)Oc1cccc(NC(=O)c2ccccn2)c1