Reaction Details
TargetCarbonic anhydrase 2
LigandBDBM50116574
Substrate/Competitorn/a
Meas. Tech.ChEMBL_1513115 (CHEMBL3610543)
Ki 88±n/a nM
Citation Congiu, COnnis, VDeplano, ABalboni, GDedeoglu, NSupuran, CT Synthesis of sulfonamides incorporating piperazinyl-ureido moieties and their carbonic anhydrase I, II, IX and XII inhibitory activity. Bioorg Med Chem Lett25:3850-3 (2015) 
 
Carbonic anhydrase 2
Name:Carbonic anhydrase 2
Type:Enzyme
Mol. Mass.:29250.71
Organism:Homo sapiens (Human)
Description:P00918
Residue:260
BDBM50116574
NameBDBM50116574
Synonyms:CHEMBL3609195
TypeSmall organic molecule
Emp. Form.C13H20N4O4S
Mol. Mass.328.387
SMILESNS(=O)(=O)c1ccc(NC(=O)N2CCN(CCO)CC2)cc1