Reaction Details
TargetCarbonic anhydrase 12
LigandBDBM50116575
Substrate/Competitorn/a
Meas. Tech.ChEMBL_1513117 (CHEMBL3610545)
Ki 165±n/a nM
Citation Congiu, COnnis, VDeplano, ABalboni, GDedeoglu, NSupuran, CT Synthesis of sulfonamides incorporating piperazinyl-ureido moieties and their carbonic anhydrase I, II, IX and XII inhibitory activity. Bioorg Med Chem Lett25:3850-3 (2015) 
 
Carbonic anhydrase 12
Name:Carbonic anhydrase 12
Type:Enzyme
Mol. Mass.:39456.00
Organism:Homo sapiens (Human)
Description:Catalytic domain of human cloned isozyme was used in the assay
Residue:354
BDBM50116575
NameBDBM50116575
Synonyms:CHEMBL3609196
TypeSmall organic molecule
Emp. Form.C18H21ClN4O3S
Mol. Mass.408.902
SMILESNS(=O)(=O)c1ccc(NC(=O)N2CCN(Cc3ccc(Cl)cc3)CC2)cc1