Reaction Details
TargetCarbonic anhydrase 12
LigandBDBM50116585
Substrate/Competitorn/a
Meas. Tech.ChEMBL_1513117 (CHEMBL3610545)
Ki 144±n/a nM
Citation Congiu, COnnis, VDeplano, ABalboni, GDedeoglu, NSupuran, CT Synthesis of sulfonamides incorporating piperazinyl-ureido moieties and their carbonic anhydrase I, II, IX and XII inhibitory activity. Bioorg Med Chem Lett25:3850-3 (2015) 
 
Carbonic anhydrase 12
Name:Carbonic anhydrase 12
Type:Enzyme
Mol. Mass.:39456.00
Organism:Homo sapiens (Human)
Description:Catalytic domain of human cloned isozyme was used in the assay
Residue:354
BDBM50116585
NameBDBM50116585
Synonyms:CHEMBL3609478
TypeSmall organic molecule
Emp. Form.C16H19N5O3S
Mol. Mass.361.419
SMILESNS(=O)(=O)c1ccc(NC(=O)N2CCN(CC2)c2ccccn2)cc1