Reaction Details
TargetCarbonic anhydrase 12
LigandBDBM50116588
Substrate/Competitorn/a
Meas. Tech.ChEMBL_1513117 (CHEMBL3610545)
Ki 17±n/a nM
Citation Congiu, COnnis, VDeplano, ABalboni, GDedeoglu, NSupuran, CT Synthesis of sulfonamides incorporating piperazinyl-ureido moieties and their carbonic anhydrase I, II, IX and XII inhibitory activity. Bioorg Med Chem Lett25:3850-3 (2015) 
 
Carbonic anhydrase 12
Name:Carbonic anhydrase 12
Type:Enzyme
Mol. Mass.:39456.00
Organism:Homo sapiens (Human)
Description:Catalytic domain of human cloned isozyme was used in the assay
Residue:354
BDBM50116588
NameBDBM50116588
Synonyms:CHEMBL3609481
TypeSmall organic molecule
Emp. Form.C17H18N6O3S
Mol. Mass.386.428
SMILESNS(=O)(=O)c1ccc(NC(=O)N2CCN(CC2)c2ncccc2C#N)cc1