Reaction Details
TargetPolyunsaturated fatty acid 5-lipoxygenase
LigandBDBM50116891
Substrate/Competitorn/a
Meas. Tech.ChEMBL_1515806 (CHEMBL3614568)
IC50 600±n/a nM
Citation De Lucia, DLucio, OMMusio, BBender, AListing, MDennhardt, SKoeberle, AGarscha, URizzo, RManfredini, SWerz, OLey, SV Design, synthesis and evaluation of semi-synthetic triazole-containing caffeic acid analogues as 5-lipoxygenase inhibitors. Eur J Med Chem101:573-83 (2015) 
 
Polyunsaturated fatty acid 5-lipoxygenase
Name:Polyunsaturated fatty acid 5-lipoxygenase
Type:Enzyme
Mol. Mass.:77972.74
Organism:Homo sapiens (Human)
Description:Recombinant protein was purified from E. coli lysate. After ammonium sulfate precipitation and subsequent steps, the supernatant (S100) was used for 5-LO activity assay.
Residue:674
BDBM50116891
NameBDBM50116891
Synonyms:CHEMBL3613037
TypeSmall organic molecule
Emp. Form.C33H33N3O12
Mol. Mass.663.628
SMILESCC(=O)Oc1ccc(\C=C\C(=O)OCCCn2cc(CCOC(=O)\C=C\c3ccc(OC(C)=O)c(OC(C)=O)c3)nn2)cc1OC(C)=O