Reaction Details
TargetPolyunsaturated fatty acid 5-lipoxygenase
LigandBDBM50116896
Substrate/Competitorn/a
Meas. Tech.ChEMBL_1515806 (CHEMBL3614568)
IC50 3100±n/a nM
Citation De Lucia, DLucio, OMMusio, BBender, AListing, MDennhardt, SKoeberle, AGarscha, URizzo, RManfredini, SWerz, OLey, SV Design, synthesis and evaluation of semi-synthetic triazole-containing caffeic acid analogues as 5-lipoxygenase inhibitors. Eur J Med Chem101:573-83 (2015) 
 
Polyunsaturated fatty acid 5-lipoxygenase
Name:Polyunsaturated fatty acid 5-lipoxygenase
Type:Enzyme
Mol. Mass.:77972.74
Organism:Homo sapiens (Human)
Description:Recombinant protein was purified from E. coli lysate. After ammonium sulfate precipitation and subsequent steps, the supernatant (S100) was used for 5-LO activity assay.
Residue:674
BDBM50116896
NameBDBM50116896
Synonyms:CHEMBL3613032
TypeSmall organic molecule
Emp. Form.C23H29N3O7
Mol. Mass.459.4923
SMILESCC(=O)Oc1ccc(\C=C\C(=O)OCCCCCc2cnnn2CCCO)cc1OC(C)=O