Reaction Details
TargetPolyunsaturated fatty acid 5-lipoxygenase
LigandBDBM50116898
Substrate/Competitorn/a
Meas. Tech.ChEMBL_1515808 (CHEMBL3614570)
IC50 7400±n/a nM
Citation De Lucia, DLucio, OMMusio, BBender, AListing, MDennhardt, SKoeberle, AGarscha, URizzo, RManfredini, SWerz, OLey, SV Design, synthesis and evaluation of semi-synthetic triazole-containing caffeic acid analogues as 5-lipoxygenase inhibitors. Eur J Med Chem101:573-83 (2015) 
 
Polyunsaturated fatty acid 5-lipoxygenase
Name:Polyunsaturated fatty acid 5-lipoxygenase
Type:Enzyme
Mol. Mass.:77972.74
Organism:Homo sapiens (Human)
Description:Recombinant protein was purified from E. coli lysate. After ammonium sulfate precipitation and subsequent steps, the supernatant (S100) was used for 5-LO activity assay.
Residue:674
BDBM50116898
NameBDBM50116898
Synonyms:CHEMBL3613030
TypeSmall organic molecule
Emp. Form.C20H23N3O7
Mol. Mass.417.4125
SMILESCC(=O)Oc1ccc(\C=C\C(=O)OCCc2cnnn2CCCO)cc1OC(C)=O