Reaction Details
TargetCannabinoid receptor 2
LigandBDBM50116942
Substrate/Competitorn/a
Meas. Tech.ChEMBL_1516109 (CHEMBL3615752)
Ki>5000±n/a nM
Citation Ragusa, GGómez-Cañas, MMorales, PHurst, DPDeligia, FPazos, RPinna, GAFernández-Ruiz, JGoya, PReggio, PHJagerovic, NGarcía-Arencibia, MMurineddu, G Synthesis, pharmacological evaluation and docking studies of pyrrole structure-based CB2 receptor antagonists. Eur J Med Chem101:651-67 (2015) 
 
Cannabinoid receptor 2
Name:Cannabinoid receptor 2
Type:G Protein-Coupled Receptor (GPCR)
Mol. Mass.:39690.94
Organism:Homo sapiens (Human)
Description:P34972
Residue:360
BDBM50116942
NameBDBM50116942
Synonyms:CHEMBL3613105
TypeSmall organic molecule
Emp. Form.C28H33ClN2O
Mol. Mass.449.027
SMILESC[C@@H](NC(=O)c1cc(-c2ccc(Cl)c(C)c2)n(Cc2ccc(C)cc2)c1)C1CCCCC1