Reaction Details
TargetCannabinoid receptor 2
LigandBDBM50116991
Substrate/Competitorn/a
Meas. Tech.ChEMBL_1516109 (CHEMBL3615752)
Ki>5000±n/a nM
Citation Ragusa, GGómez-Cañas, MMorales, PHurst, DPDeligia, FPazos, RPinna, GAFernández-Ruiz, JGoya, PReggio, PHJagerovic, NGarcía-Arencibia, MMurineddu, G Synthesis, pharmacological evaluation and docking studies of pyrrole structure-based CB2 receptor antagonists. Eur J Med Chem101:651-67 (2015) 
 
Cannabinoid receptor 2
Name:Cannabinoid receptor 2
Type:G Protein-Coupled Receptor (GPCR)
Mol. Mass.:39690.94
Organism:Homo sapiens (Human)
Description:P34972
Residue:360
BDBM50116991
NameBDBM50116991
Synonyms:CHEMBL3613113
TypeSmall organic molecule
Emp. Form.C30H25ClN2O
Mol. Mass.464.985
SMILESCc1ccc(Cn2cc(cc2-c2ccc(Cl)c(C)c2)C(=O)Nc2cccc3ccccc23)cc1