Reaction Details
TargetAdenosine receptor A1
LigandBDBM50117120
Substrate/Competitorn/a
Meas. Tech.ChEMBL_1516113 (CHEMBL3615756)
Ki 3.9±n/a nM
Citation Louvel, JGuo, DSoethoudt, MMocking, TALenselink, EBMulder-Krieger, THeitman, LHIJzerman, AP Structure-kinetics relationships of Capadenoson derivatives as adenosine A1 receptor agonists. Eur J Med Chem101:681-91 (2015) 
 
Adenosine receptor A1
Name:Adenosine receptor A1
Type:G Protein-Coupled Receptor (GPCR)
Mol. Mass.:36520.92
Organism:Homo sapiens (Human)
Description:P30542
Residue:326
BDBM50117120
NameBDBM50117120
Synonyms:CHEMBL3613129
TypeSmall organic molecule
Emp. Form.C24H16IN5OS2
Mol. Mass.581.451
SMILESCOc1ccc(cc1)-c1c(C#N)c(N)nc(SCc2csc(n2)-c2ccc(I)cc2)c1C#N