Reaction Details
TargetAdenosine receptor A1
LigandBDBM50117134
Substrate/Competitorn/a
Meas. Tech.ChEMBL_1516113 (CHEMBL3615756)
Ki 3.2±n/a nM
Citation Louvel, JGuo, DSoethoudt, MMocking, TALenselink, EBMulder-Krieger, THeitman, LHIJzerman, AP Structure-kinetics relationships of Capadenoson derivatives as adenosine A1 receptor agonists. Eur J Med Chem101:681-91 (2015) 
 
Adenosine receptor A1
Name:Adenosine receptor A1
Type:G Protein-Coupled Receptor (GPCR)
Mol. Mass.:36520.92
Organism:Homo sapiens (Human)
Description:P30542
Residue:326
BDBM50117134
NameBDBM50117134
Synonyms:CHEMBL3613126
TypeSmall organic molecule
Emp. Form.C22H20N6O2S2
Mol. Mass.464.563
SMILESCOc1ccc(cc1)-c1c(C#N)c(N)nc(SCc2csc(n2)N2CCOCC2)c1C#N