Reaction Details
TargetLIM domain kinase 1
LigandBDBM50117500
Substrate/Competitorn/a
Meas. Tech.ChEMBL_1514397 (CHEMBL3615476)
IC50 22±n/a nM
Citation Boland, SBourin, AAlen, JGeraets, JSchroeders, PCastermans, KKindt, NBoumans, NPanitti, LVanormelingen, JFransen, SVan de Velde, SDefert, O Design, synthesis and biological characterization of selective LIMK inhibitors. Bioorg Med Chem Lett25:4005-10 (2015) 
 
LIM domain kinase 1
Name:LIM domain kinase 1
Type:Enzyme Catalytic Domain
Mol. Mass.:72591.81
Organism:Homo sapiens (Human)
Description:gi_4505001
Residue:647
BDBM50117500
NameBDBM50117500
Synonyms:CHEMBL3613624
TypeSmall organic molecule
Emp. Form.C26H35N7O3
Mol. Mass.493.6012
SMILESCN(C)CC1(CCN(CC1)c1ncnc2[nH]c(C)c(C)c12)C(=O)Nc1cccc(OC(=O)N(C)C)c1