Reaction Details
TargetRho-associated protein kinase 2
LigandBDBM50117370
Substrate/Competitorn/a
Meas. Tech.ChEMBL_1514399 (CHEMBL3615478)
IC50 40.0±n/a nM
Citation Boland, SBourin, AAlen, JGeraets, JSchroeders, PCastermans, KKindt, NBoumans, NPanitti, LVanormelingen, JFransen, SVan de Velde, SDefert, O Design, synthesis and biological characterization of selective LIMK inhibitors. Bioorg Med Chem Lett25:4005-10 (2015) 
 
Rho-associated protein kinase 2
Name:Rho-associated protein kinase 2
Type:Protein
Mol. Mass.:160885.43
Organism:Homo sapiens (Human)
Description:O75116
Residue:1388
BDBM50117370
NameBDBM50117370
Synonyms:CHEMBL3613599
TypeSmall organic molecule
Emp. Form.C25H33N7O3
Mol. Mass.479.5746
SMILESCN(C)CC1(CCN(CC1)c1ncnc2[nH]cc(C)c12)C(=O)Nc1cccc(OC(=O)N(C)C)c1