Reaction Details
TargetLIM domain kinase 2
LigandBDBM50117502
Substrate/Competitorn/a
Meas. Tech.ChEMBL_1514398 (CHEMBL3615477)
IC50 8±n/a nM
Citation Boland, SBourin, AAlen, JGeraets, JSchroeders, PCastermans, KKindt, NBoumans, NPanitti, LVanormelingen, JFransen, SVan de Velde, SDefert, O Design, synthesis and biological characterization of selective LIMK inhibitors. Bioorg Med Chem Lett25:4005-10 (2015) 
 
LIM domain kinase 2
Name:LIM domain kinase 2
Type:PROTEIN
Mol. Mass.:72238.81
Organism:Homo sapiens (Human)
Description:ChEMBL_1514398
Residue:638
BDBM50117502
NameBDBM50117502
Synonyms:CHEMBL3613622
TypeSmall organic molecule
Emp. Form.C24H30N6O3
Mol. Mass.450.5334
SMILESCOC(=O)c1cccc(NC(=O)C2(CN(C)C)CCN(CC2)c2ncnc3[nH]c(C)cc23)c1