Reaction Details
TargetRho-associated protein kinase 2
LigandBDBM50117627
Substrate/Competitorn/a
Meas. Tech.ChEMBL_1514399 (CHEMBL3615478)
IC50 67±n/a nM
Citation Boland, SBourin, AAlen, JGeraets, JSchroeders, PCastermans, KKindt, NBoumans, NPanitti, LVanormelingen, JFransen, SVan de Velde, SDefert, O Design, synthesis and biological characterization of selective LIMK inhibitors. Bioorg Med Chem Lett25:4005-10 (2015) 
 
Rho-associated protein kinase 2
Name:Rho-associated protein kinase 2
Type:Protein
Mol. Mass.:160885.43
Organism:Homo sapiens (Human)
Description:O75116
Residue:1388
BDBM50117627
NameBDBM50117627
Synonyms:CHEMBL3613614
TypeSmall organic molecule
Emp. Form.C20H22N6O3
Mol. Mass.394.4271
SMILESCOC(=O)c1cccc(NC(=O)C2(N)CCN(CC2)c2ncnc3[nH]ccc23)c1