Reaction Details
TargetEpidermal growth factor receptor
LigandBDBM31090
Substrate/Competitorn/a
Meas. Tech.ChEMBL_1515019 (CHEMBL3616083)
IC50 39±n/a nM
Citation Ibrahim, DAAbou El Ella, DAEl-Motwally, AMAly, RM Molecular design and synthesis of certain new quinoline derivatives having potential anticancer activity. Eur J Med Chem102:115-31 (2015) 
 
Epidermal growth factor receptor
Name:Epidermal growth factor receptor
Type:Receptor Kinase Domain
Mol. Mass.:134279.59
Organism:Homo sapiens (Human)
Description:P00533
Residue:1210
BDBM31090
NameBDBM31090
Synonyms:(E)-N-[4-(3-chloro-4-fluoro-anilino)-3-cyano-7-ethoxy-6-quinolyl]-4-(dimethylamino)but-2-enamide (E)-N-[4-(3-chloro-4-fluoroanilino)-3-cyano-7-ethoxyquinolin-6-yl]-4-(dimethylamino)but-2-enamide EKB-569 cid_6445562
TypeSmall organic molecule
Emp. Form.C24H23ClFN5O2
Mol. Mass.467.923
SMILESCCOc1cc2ncc(C#N)c(Nc3ccc(F)c(Cl)c3)c2cc1NC(=O)\C=C\CN(C)C