Reaction Details
TargetCarbonic anhydrase 7
LigandBDBM50117677
Substrate/Competitorn/a
Meas. Tech.ChEMBL_1515207 (CHEMBL3614554)
Ki 3.1±n/a nM
Citation Buemi, MRDe Luca, LFerro, SBruno, ECeruso, MSupuran, CTPospí?ilová, KBrynda, JRezácová, PGitto, R Carbonic anhydrase inhibitors: Design, synthesis and structural characterization of new heteroaryl-N-carbonylbenzenesulfonamides targeting druggable human carbonic anhydrase isoforms. Eur J Med Chem102:223-32 (2015) 
 
Carbonic anhydrase 7
Name:Carbonic anhydrase 7
Type:Enzyme
Mol. Mass.:29664.11
Organism:Homo sapiens (Human)
Description:Human cloned isozyme.
Residue:264
BDBM50117677
NameBDBM50117677
Synonyms:CHEMBL3613778
TypeSmall organic molecule
Emp. Form.C17H18N2O4S
Mol. Mass.346.401
SMILESCOc1ccc2CN(CCc2c1)C(=O)c1ccc(cc1)S(N)(=O)=O