Reaction Details
TargetMenin
LigandBDBM152230
Substrate/Competitorn/a
Meas. Tech.ChEMBL_1515211 (CHEMBL3614558)
IC50 1200±n/a nM
Citation Pollock, JBorkin, DLund, GPurohit, TDyguda-Kazimierowicz, EGrembecka, JCierpicki, T Rational Design of Orthogonal Multipolar Interactions with Fluorine in Protein-Ligand Complexes. J Med Chem58:7465-74 (2015) 
 
Menin
Name:Menin
Type:Protein
Mol. Mass.:68022.55
Organism:Homo sapiens (Human)
Description:O00255
Residue:610
BDBM152230
NameBDBM152230
Synonyms:US8993552, 65
TypeSmall organic molecule
Emp. Form.C17H23N5S2
Mol. Mass.361.528
SMILESCCc1cc2c(ncnc2s1)N1CCN(CC1)C1=NCC(C)(C)S1